Reaction Details
TargetPhenylethanolamine N-methyltransferase
LigandBDBM50026331
Substrate/Competitorn/a
Meas. Tech.ChEBML_152425
Ki 7600±n/a nM
Citation Houston, DMMatuszewska, BBorchardt, RT Potential inhibitors of S-adenosylmethionine-dependent methyltransferases. 10. Base- and amino acid modified analogues of S-aristeromycinyl-L-homocysteine. J Med Chem28:478-82 (1985) Phenylethanolamine N-methyltransferase
Name:Phenylethanolamine N-methyltransferase
Type:Enzyme
Mol. Mass.:30916.97
Organism:Bos taurus (bovine)
Description:n/a
Residue:283
BDBM50026331
NameBDBM50026331
Synonyms:2-Amino-4-[4-(6-amino-purin-9-yl)-2,3-dihydroxy-cyclopentylmethylsulfanyl]-butyric acid L-2-Amino-4-[5-(6-amino-purin-9-yl)-3,4-dihydroxy-tetrahydro-furan-2-ylmethylsulfanyl]-butyric acid
TypeSmall organic molecule
Emp. Form.C15H22N6O4S
Mol. Mass.382.438
SMILESNC(CCSCC1CC(C(O)C1O)n1cnc2c(N)ncnc12)C(O)=O