Reaction Details
TargetHistamine N-methyltransferase
LigandBDBM50009672
Substrate/Competitorn/a
Meas. Tech.ChEBML_87234
Ki 18100±n/a nM
Citation Houston, DMMatuszewska, BBorchardt, RT Potential inhibitors of S-adenosylmethionine-dependent methyltransferases. 10. Base- and amino acid modified analogues of S-aristeromycinyl-L-homocysteine. J Med Chem28:478-82 (1985) Histamine N-methyltransferase
Name:Histamine N-methyltransferase
Type:PROTEIN
Mol. Mass.:33287.63
Organism:Homo sapiens (Human)
Description:ChEMBL_87234
Residue:292
BDBM50009672
NameBDBM50009672
Synonyms:AdoHcy S-(5'-adenosyl)-L-homocysteine S-[1-(adenin-9-yl)-1,5-dideoxy-beta-D-ribofuranos-5-yl]-L-homocysteine SAH US9175331, 1 | US9333217, S-Adenosyl-L-homocysteine (SAH)
TypeSmall organic molecule
Emp. Form.C14H20N6O5S
Mol. Mass.384.411
SMILESN[C@@H](CCSC[C@H]1O[C@H]([C@H](O)[C@@H]1O)n1cnc2c(N)ncnc12)C(O)=O