Reaction Details
TargetPhenylethanolamine N-methyltransferase
LigandBDBM50009672
Substrate/Competitorn/a
Meas. Tech.ChEBML_152425
Ki 29000±n/a nM
Citation Houston, DMMatuszewska, BBorchardt, RT Potential inhibitors of S-adenosylmethionine-dependent methyltransferases. 10. Base- and amino acid modified analogues of S-aristeromycinyl-L-homocysteine. J Med Chem28:478-82 (1985) Phenylethanolamine N-methyltransferase
Name:Phenylethanolamine N-methyltransferase
Type:Enzyme
Mol. Mass.:30916.97
Organism:Bos taurus (bovine)
Description:n/a
Residue:283
BDBM50009672
NameBDBM50009672
Synonyms:AdoHcy S-(5'-adenosyl)-L-homocysteine S-[1-(adenin-9-yl)-1,5-dideoxy-beta-D-ribofuranos-5-yl]-L-homocysteine SAH US9175331, 1 | US9333217, S-Adenosyl-L-homocysteine (SAH)
TypeSmall organic molecule
Emp. Form.C14H20N6O5S
Mol. Mass.384.411
SMILESN[C@@H](CCSC[C@H]1O[C@H]([C@H](O)[C@@H]1O)n1cnc2c(N)ncnc12)C(O)=O