Reaction Details
TargetAdenosine receptor A2a
LigandBDBM50020847
Substrate/Competitorn/a
Meas. Tech.ChEBML_27639
Ki 1700±n/a nM
Citation Daly, JWPadgett, WShamim, MTButts-Lamb, PWaters, J 1,3-Dialkyl-8-(p-sulfophenyl)xanthines: potent water-soluble antagonists for A1- and A2-adenosine receptors. J Med Chem28:487-92 (1985) Adenosine receptor A2a
Name:Adenosine receptor A2a
Type:Enzyme Catalytic Domain
Mol. Mass.:44955.08
Organism:GUINEA PIG
Description:ADENOSINE A2 0 GUINEA PIG::P46616
Residue:409
BDBM50020847
NameBDBM50020847
Synonyms:8-(2-Amino-phenyl)-1,3-dimethyl-3,7-dihydro-purine-2,6-dione CHEMBL11120
TypeSmall organic molecule
Emp. Form.C13H13N5O2
Mol. Mass.271.2746
SMILESCn1c2nc([nH]c2c(=O)n(C)c1=O)-c1ccccc1N