Reaction Details
TargetAdenosine receptor A2a
LigandBDBM50018162
Substrate/Competitorn/a
Meas. Tech.ChEBML_27639
Ki 710±n/a nM
Citation Daly, JWPadgett, WShamim, MTButts-Lamb, PWaters, J 1,3-Dialkyl-8-(p-sulfophenyl)xanthines: potent water-soluble antagonists for A1- and A2-adenosine receptors. J Med Chem28:487-92 (1985) Adenosine receptor A2a
Name:Adenosine receptor A2a
Type:Enzyme Catalytic Domain
Mol. Mass.:44955.08
Organism:GUINEA PIG
Description:ADENOSINE A2 0 GUINEA PIG::P46616
Residue:409
BDBM50018162
NameBDBM50018162
Synonyms:4-(2,6-Dioxo-1,3-dipropyl-2,3,6,7-tetrahydro-1H-purin-8-yl)-benzenesulfonic acid 4-(2,6-dioxo-1,3-dipropyl-2,3,6,7-tetrahydro-1H-purin-8-yl)benzenesulfonic acid | CHEMBL418333
TypeSmall organic molecule
Emp. Form.C17H20N4O5S
Mol. Mass.392.429
SMILESCCCn1c2nc([nH]c2c(=O)n(CCC)c1=O)-c1ccc(cc1)S(O)(=O)=O