Reaction Details
TargetAdenosine receptor A2a
LigandBDBM82025
Substrate/Competitorn/a
Meas. Tech.ChEBML_27639
Ki 300±n/a nM
Citation Daly, JWPadgett, WShamim, MTButts-Lamb, PWaters, J 1,3-Dialkyl-8-(p-sulfophenyl)xanthines: potent water-soluble antagonists for A1- and A2-adenosine receptors. J Med Chem28:487-92 (1985) Adenosine receptor A2a
Name:Adenosine receptor A2a
Type:Enzyme Catalytic Domain
Mol. Mass.:44955.08
Organism:GUINEA PIG
Description:ADENOSINE A2 0 GUINEA PIG::P46616
Residue:409
BDBM82025
NameBDBM82025
Synonyms:1,3-Dipropyl-8-phenylxanthine CAS_128784 NSC_128784
TypeSmall organic molecule
Emp. Form.C17H20N4O2
Mol. Mass.312.3663
SMILESCCCn1c2nc([nH]c2c(=O)n(CCC)c1=O)-c1ccccc1