Reaction Details
TargetDihydrofolate reductase
LigandBDBM50026383
Substrate/Competitorn/a
Meas. Tech.ChEBML_53934
IC50 43±n/a nM
Citation Taylor, ECHarrington, PJFletcher, SRBeardsley, GPMoran, RG Synthesis of the antileukemic agents 5,10-dideazaaminopterin and 5,10-dideaza-5,6,7,8-tetrahydroaminopterin. J Med Chem28:914-21 (1985) Dihydrofolate reductase
Name:Dihydrofolate reductase
Type:PROTEIN
Mol. Mass.:18437.08
Organism:Lactobacillus casei
Description:ChEMBL_1357878
Residue:163
BDBM50026383
NameBDBM50026383
Synonyms:2-{4-[2-(2,4-Diamino-pyrido[2,3-d]pyrimidin-6-yl)-ethyl]-benzoylamino}-pentanedioic acid | CHEMBL124631
TypeSmall organic molecule
Emp. Form.C21H22N6O5
Mol. Mass.438.4366
SMILESNc1nc(N)c2cc(CCc3ccc(cc3)C(=O)NC(CCC(O)=O)C(O)=O)cnc2n1