Reaction Details
TargetDelta-type opioid receptor
LigandBDBM60212
Substrate/Competitorn/a
Meas. Tech.ChEBML_147283
Ki 6.6±n/a nM
Citation Archer, SSeyed-Mozaffari, AWard, SKosterlitz, HWPaterson, SJMcKnight, ATCorbett, AD 10-Ketonaltrexone and 10-ketooxymorphone. J Med Chem28:974-6 (1985) Delta-type opioid receptor
Name:Delta-type opioid receptor
Type:G Protein-Coupled Receptor (GPCR)
Mol. Mass.:40382.98
Organism:Homo sapiens (Human)
Description:Competition binding assays were carried out using membrane preparations from transfected HN9.10 cells that constitutively expressed the delta opioid receptor.
Residue:372
BDBM60212
NameBDBM60212
Synonyms:(4R,4aS,7aR,12bS)-3-(cyclopropylmethyl)-4a,9-bis(oxidanyl)-2,4,5,6,7a,13-hexahydro-1H-4,12-methanobenzofuro[3,2-e]isoquinoline-7-one;hydrochloride MLS000069607 SMR000058767 US9107954, naltrexone | cid_5485201
TypeSmall organic molecule
Emp. Form.C20H23NO4
Mol. Mass.341.4009
SMILESOc1ccc2C[C@H]3N(CC4CC4)CC[C@@]45[C@@H](Oc1c24)C(=O)CC[C@@]35O