Reaction Details
TargetAminopeptidase N
LigandBDBM50002022
Substrate/Competitorn/a
Meas. Tech.ChEMBL_32815 (CHEMBL646467)
IC50 2±n/a nM
Citation Fournié-Zaluski, MCCoulaud, ABouboutou, RChaillet, PDevin, JWaksman, GCostentin, JRoques, BP New bidentates as full inhibitors of enkephalin-degrading enzymes: synthesis and analgesic properties. J Med Chem28:1158-69 (1985) Aminopeptidase N
Name:Aminopeptidase N
Type:Protein
Mol. Mass.:108810.25
Organism:Sus scrofa (Pig)
Description:P15145
Residue:963
BDBM50002022
NameBDBM50002022
Synonyms:(2-Benzyl-3-hydroxycarbamoyl-propionylamino)-acetic acid CHEMBL16779
TypeSmall organic molecule
Emp. Form.C13H16N2O5
Mol. Mass.280.2765
SMILESONC(=O)CC(Cc1ccccc1)C(=O)NCC(O)=O