Reaction Details
TargetAminopeptidase N
LigandBDBM50002035
Substrate/Competitorn/a
Meas. Tech.ChEMBL_32815 (CHEMBL646467)
IC50 1±n/a nM
Citation Fournié-Zaluski, MCCoulaud, ABouboutou, RChaillet, PDevin, JWaksman, GCostentin, JRoques, BP New bidentates as full inhibitors of enkephalin-degrading enzymes: synthesis and analgesic properties. J Med Chem28:1158-69 (1985) Aminopeptidase N
Name:Aminopeptidase N
Type:Protein
Mol. Mass.:108810.25
Organism:Sus scrofa (Pig)
Description:P15145
Residue:963
BDBM50002035
NameBDBM50002035
Synonyms:(2-Hydroxycarbamoyl-3-phenyl-propionylamino)-acetic acid CHEMBL17107
TypeSmall organic molecule
Emp. Form.C12H14N2O5
Mol. Mass.266.25
SMILESONC(=O)C(Cc1ccccc1)C(=O)NCC(O)=O