Reaction Details
TargetAngiotensin-converting enzyme
LigandBDBM50452241
Substrate/Competitorn/a
Meas. Tech.ChEBML_36882
IC50 100±n/a nM
Citation Roark, WHTinney, FJCohen, DEssenburg, ADKaplan, HR Synthesis and biological activity of modified peptide inhibitors of angiotensin-converting enzyme. J Med Chem28:1291-5 (1985) Angiotensin-converting enzyme
Name:Angiotensin-converting enzyme
Type:Enzyme
Mol. Mass.:149709.01
Organism:Homo sapiens (Human)
Description:n/a
Residue:1306
BDBM50452241
NameBDBM50452241
Synonyms:CHEMBL2079671
TypeSmall organic molecule
Emp. Form.C24H34N2O5
Mol. Mass.430.5372
SMILESCCOC(=O)[C@H](CCc1ccccc1)N[C@@H](C)C(=O)N1C2CCCCC2C[C@H]1C(O)=O