Reaction Details
TargetAdenosine receptor A1
LigandBDBM50367270
Substrate/Competitorn/a
Meas. Tech.ChEBML_29631
Ki 16±n/a nM
Citation Jacobson, KAKirk, KLPadgett, WLDaly, JW Functionalized congeners of adenosine: preparation of analogues with high affinity for A1-adenosine receptors. J Med Chem28:1341-6 (1985) Adenosine receptor A1
Name:Adenosine receptor A1
Type:Protein
Mol. Mass.:36704.13
Organism:Rattus norvegicus (rat)
Description:n/a
Residue:326
BDBM50367270
NameBDBM50367270
Synonyms:CHEMBL606297
TypeSmall organic molecule
Emp. Form.C19H22N6O5
Mol. Mass.414.4152
SMILESCNC(=O)Cc1ccc(Nc2ncnc3n(cnc23)C2O[C@H](CO)[C@@H](O)[C@H]2O)cc1