Reaction Details
TargetAdenosine receptor A1
LigandBDBM50367278
Substrate/Competitorn/a
Meas. Tech.ChEBML_29631
Ki 1.7±n/a nM
Citation Jacobson, KAKirk, KLPadgett, WLDaly, JW Functionalized congeners of adenosine: preparation of analogues with high affinity for A1-adenosine receptors. J Med Chem28:1341-6 (1985) Adenosine receptor A1
Name:Adenosine receptor A1
Type:Protein
Mol. Mass.:36704.13
Organism:Rattus norvegicus (rat)
Description:n/a
Residue:326
BDBM50367278
NameBDBM50367278
Synonyms:CHEMBL604003
TypeSmall organic molecule
Emp. Form.C25H26N6O5
Mol. Mass.490.5111
SMILESCc1ccc(NC(=O)Cc2ccc(Nc3ncnc4n(cnc34)C3O[C@H](CO)[C@@H](O)[C@H]3O)cc2)cc1