Reaction Details
TargetPhenylethanolamine N-methyltransferase
LigandBDBM50024839
Substrate/Competitorn/a
Meas. Tech.ChEBML_153307
Ki 304000±n/a nM
Citation Grunewald, GLArrington, HSBartlett, WJReitz, TJSall, DJ Binding requirements of phenolic phenylethylamines in the benzonorbornene skeleton at the active site of phenylethanolamine N-methyltransferase. J Med Chem29:1972-82 (1986) Phenylethanolamine N-methyltransferase
Name:Phenylethanolamine N-methyltransferase
Type:Enzyme
Mol. Mass.:30916.97
Organism:Bos taurus (bovine)
Description:n/a
Residue:283
BDBM50024839
NameBDBM50024839
Synonyms:2-Amino-1,2,3,4-tetrahydro-1,4-methano-naphthalen-6-ol | CHEMBL61749
TypeSmall organic molecule
Emp. Form.C11H13NO
Mol. Mass.175.227
SMILESN[C@@H]1CC2CC1c1ccc(O)cc21