Reaction Details
TargetPhenylethanolamine N-methyltransferase
LigandBDBM50024814
Substrate/Competitorn/a
Meas. Tech.ChEBML_153307
Ki 258000±n/a nM
Citation Grunewald, GLArrington, HSBartlett, WJReitz, TJSall, DJ Binding requirements of phenolic phenylethylamines in the benzonorbornene skeleton at the active site of phenylethanolamine N-methyltransferase. J Med Chem29:1972-82 (1986) Phenylethanolamine N-methyltransferase
Name:Phenylethanolamine N-methyltransferase
Type:Enzyme
Mol. Mass.:30916.97
Organism:Bos taurus (bovine)
Description:n/a
Residue:283
BDBM50024814
NameBDBM50024814
Synonyms:CHEMBL60005 | Tricyclo[6.2.2.0*2,7*]dodeca-2(7),3,5-trien-9-ylamine
TypeSmall organic molecule
Emp. Form.C12H15N
Mol. Mass.173.2542
SMILESN[C@@H]1CC2CCC1c1ccccc21