Reaction Details
TargetPepsin A
LigandBDBM50025510
Substrate/Competitorn/a
Meas. Tech.ChEBML_154162
Ki 1.7±n/a nM
Citation Agarwal, NSRich, DH Inhibition of cathepsin D by substrate analogues containing statine and by analogues of pepstatin. J Med Chem29:2519-24 (1987) Pepsin A
Name:Pepsin A
Type:Enzyme
Mol. Mass.:41232.87
Organism:Porcine
Description:n/a
Residue:385
BDBM50025510
NameBDBM50025510
Synonyms:2-{2-[2-(4-{2-[2-(2-tert-Butoxycarbonylamino-3-phenyl-propionylamino)-propionylamino]-propionylamino}-3-hydroxy-6-methyl-heptanoylamino)-3-phenyl-propionylamino]-3-methyl-butyrylamino}-4-methyl-pentanoic acid methyl ester | CHEMBL3142507
TypeSmall organic molecule
Emp. Form.C49H75N7O11
Mol. Mass.938.1601
SMILESCOC(=O)[C@H](CC(C)C)NC(=O)[C@@H](NC(=O)[C@H](Cc1ccccc1)NC(=O)C[C@H](O)[C@H](CC(C)C)NC(=O)[C@H](C)NC(=O)[C@H](C)NC(=O)[C@H](Cc1ccccc1)NC(=O)OC(C)(C)C)C(C)C