Reaction Details
TargetPepsin A
LigandBDBM50025513
Substrate/Competitorn/a
Meas. Tech.ChEBML_154162
Ki 2.8±n/a nM
Citation Agarwal, NSRich, DH Inhibition of cathepsin D by substrate analogues containing statine and by analogues of pepstatin. J Med Chem29:2519-24 (1987) Pepsin A
Name:Pepsin A
Type:Enzyme
Mol. Mass.:41232.87
Organism:Porcine
Description:n/a
Residue:385
BDBM50025513
NameBDBM50025513
Synonyms:2-[2-(4-{2-[2-(2-tert-Butoxycarbonylamino-3-phenyl-propionylamino)-propionylamino]-propionylamino}-3-hydroxy-6-methyl-heptanoylamino)-3-methyl-butyrylamino]-4-methyl-pentanoic acid methyl ester | CHEMBL3142506
TypeSmall organic molecule
Emp. Form.C40H66N6O10
Mol. Mass.790.9862
SMILESCOC(=O)[C@H](CC(C)C)NC(=O)[C@@H](NC(=O)C[C@H](O)[C@H](CC(C)C)NC(=O)[C@H](C)NC(=O)[C@H](C)NC(=O)[C@H](Cc1ccccc1)NC(=O)OC(C)(C)C)C(C)C