Reaction Details
TargetAngiotensin-converting enzyme
LigandBDBM50021269
Substrate/Competitorn/a
Meas. Tech.ChEMBL_35995 (CHEMBL644704)
IC50 19±n/a nM
Citation Thorsett, EDHarris, EEAster, SDPeterson, ERSnyder, JPSpringer, JPHirshfield, JTristram, EWPatchett, AAUlm, EH Conformationally restricted inhibitors of angiotensin converting enzyme: synthesis and computations. J Med Chem29:251-60 (1986) Angiotensin-converting enzyme
Name:Angiotensin-converting enzyme
Type:Enzyme
Mol. Mass.:149709.01
Organism:Homo sapiens (Human)
Description:n/a
Residue:1306
BDBM50021269
NameBDBM50021269
Synonyms:2-(1-Carboxymethyl-2-oxo-azepan-3-ylamino)-4-phenyl-butyric acid | CHEMBL85175
TypeSmall organic molecule
Emp. Form.C18H24N2O5
Mol. Mass.348.3936
SMILESOC(=O)CN1CCCCC(NC(CCc2ccccc2)C(O)=O)C1=O