Reaction Details
TargetAngiotensin-converting enzyme
LigandBDBM50021267
Substrate/Competitorn/a
Meas. Tech.ChEMBL_35995 (CHEMBL644704)
IC50 4.8±n/a nM
Citation Thorsett, EDHarris, EEAster, SDPeterson, ERSnyder, JPSpringer, JPHirshfield, JTristram, EWPatchett, AAUlm, EH Conformationally restricted inhibitors of angiotensin converting enzyme: synthesis and computations. J Med Chem29:251-60 (1986) Angiotensin-converting enzyme
Name:Angiotensin-converting enzyme
Type:Enzyme
Mol. Mass.:149709.01
Organism:Homo sapiens (Human)
Description:n/a
Residue:1306
BDBM50021267
NameBDBM50021267
Synonyms:2-(1-Carboxymethyl-2-oxo-azocan-3-ylamino)-4-phenyl-butyric acid | CHEMBL86518
TypeSmall organic molecule
Emp. Form.C19H26N2O5
Mol. Mass.362.4201
SMILESOC(=O)CN1CCCCCC(NC(CCc2ccccc2)C(O)=O)C1=O