Reaction Details
TargetAngiotensin-converting enzyme
LigandBDBM21642
Substrate/Competitorn/a
Meas. Tech.ChEBML_35218
IC50 590±n/a nM
Citation Ciabatti, RPadova, GBellasio, ETarzia, GDepaoli, ABattaglia, FCellentani, MBarone, DBaldoli, E Angiotensin converting enzyme inhibitors as antihypertensive agents: 1-[(2-mercaptocycloalkyl)carbonyl]-L-prolines. J Med Chem29:411-7 (1986) Angiotensin-converting enzyme
Name:Angiotensin-converting enzyme
Type:PROTEIN
Mol. Mass.:150907.81
Organism:Rattus norvegicus
Description:ChEMBL_35219
Residue:1313
BDBM21642
NameBDBM21642
Synonyms:(2S)-1-[(2S)-2-methyl-3-sulfanylpropanoyl]pyrrolidine-2-carboxylic acid Capozide Lopirin SQ14534 | US11491146, Compound L-Captopril
TypeSmall organic molecule
Emp. Form.C9H15NO3S
Mol. Mass.217.285
SMILESC[C@H](CS)C(=O)N1CCC[C@H]1C(O)=O