Reaction Details
TargetS-adenosylmethionine synthase isoform type-1/type-2
LigandBDBM50367328
Substrate/Competitorn/a
Meas. Tech.ChEMBL_104958 (CHEMBL715640)
Ki 11000±n/a nM
Citation Kappler, FHai, TTCotter, RJHyver, KJHampton, A Isozyme-specific enzyme inhibitors. 11. L-homocysteine-ATP S-C5' covalent adducts as inhibitors of rat methionine adenosyltransferases. J Med Chem29:1030-8 (1986) S-adenosylmethionine synthase isoform type-1/type-2
Name:S-adenosylmethionine synthase isoform type-1/type-2
Synonyms:S-adenosylmethionine synthetase (MAT 1 and MAT 2)
Type:n/a
Mol. Mass.:n/a
Description:ASSAY_ID of ChEMBL is 104961
Components:This complex has 2 components.
Component 1
Name:S-adenosylmethionine synthase isoform type-1
Type:PROTEIN
Mol. Mass.:43692.87
Organism:Rattus norvegicus
Description:ChEMBL_11027
Residue:397
Component 2
Name:S-adenosylmethionine synthase isoform type-2
Synonyms:AdoMet synthetase 2 MAT 2 METK2_RAT Methionine adenosyltransferase 2 S-Adenosylmethionine Synthase (AdoMet) S-adenosylmethionine synthetase gamma form | S-adenosylmethionine synthetase isoform type-2
Type:PROTEIN
Mol. Mass.:43713.68
Organism:Rattus norvegicus
Description:ChEMBL_105118
Residue:395
BDBM50367328
NameBDBM50367328
Synonyms:CHEMBL1791415
TypeSmall organic molecule
Emp. Form.C15H26N7O13P3S
Mol. Mass.637.392
SMILESNC(CCSC(CP(O)(=O)OP(O)(=O)NP(O)(O)=O)[C@H]1O[C@H]([C@H](O)[C@@H]1O)n1cnc2c(N)ncnc12)C(O)=O