Reaction Details
TargetRenin
LigandBDBM50421761
Substrate/Competitorn/a
Meas. Tech.ChEMBL_154904 (CHEMBL878421)
IC50 38±n/a nM
Citation Guégan, RDiaz, JCazaubon, CBeaumont, MCarlet, CClément, JDemarne, HMellet, MRichaud, JPSegondy, D Pepstatin analogues as novel renin inhibitors. J Med Chem29:1152-9 (1987) Renin
Name:Renin
Type:PROTEIN
Mol. Mass.:44272.67
Organism:Rattus norvegicus
Description:ChEMBL_222765
Residue:402
BDBM50421761
NameBDBM50421761
Synonyms:CHEMBL2311113
TypeSmall organic molecule
Emp. Form.C42H63N5O10
Mol. Mass.797.9771
SMILESCOC(=O)CC(O)[C@H](CC(C)C)NC(=O)[C@H](C)NC(=O)CC(O)[C@H](CC(C)C)NC(=O)[C@@H](NC(=O)[C@H](Cc1ccccc1)NC(=O)OCc1ccccc1)C(C)C