Reaction Details
TargetHistamine H1 receptor
LigandBDBM50019609
Substrate/Competitorn/a
Meas. Tech.ChEBML_75330
IC50 9.90±n/a nM
Citation Iemura, RKawashima, TFukuda, TIto, KTsukamoto, G Synthesis of 2-(4-substituted-1-piperazinyl)benzimidazoles as H1-antihistaminic agents. J Med Chem29:1178-83 (1987) Histamine H1 receptor
Name:Histamine H1 receptor
Type:G Protein-Coupled Receptor (GPCR)
Mol. Mass.:55641.53
Organism:Cavia porcellus (domestic guinea pig)
Description:Guinea pig cerebellum was used in binding assay.
Residue:488
BDBM50019609
NameBDBM50019609
Synonyms:2-(4-Methyl-[1,4]diazepan-1-yl)-1-(2-prop-2-ynyloxy-ethyl)-1H-benzoimidazole | CHEMBL279875
TypeSmall organic molecule
Emp. Form.C18H24N4O
Mol. Mass.312.4094
SMILESCN1CCCN(CC1)c1nc2ccccc2n1CCOCC#C