Reaction Details
TargetHistamine H1 receptor
LigandBDBM50019616
Substrate/Competitorn/a
Meas. Tech.ChEBML_75330
IC50 17±n/a nM
Citation Iemura, RKawashima, TFukuda, TIto, KTsukamoto, G Synthesis of 2-(4-substituted-1-piperazinyl)benzimidazoles as H1-antihistaminic agents. J Med Chem29:1178-83 (1987) Histamine H1 receptor
Name:Histamine H1 receptor
Type:G Protein-Coupled Receptor (GPCR)
Mol. Mass.:55641.53
Organism:Cavia porcellus (domestic guinea pig)
Description:Guinea pig cerebellum was used in binding assay.
Residue:488
BDBM50019616
NameBDBM50019616
Synonyms:1-Benzyl-2-(4-methyl-piperazin-1-yl)-1H-benzoimidazole | CHEMBL17246
TypeSmall organic molecule
Emp. Form.C19H22N4
Mol. Mass.306.4048
SMILESCN1CCN(CC1)c1nc2ccccc2n1Cc1ccccc1