Reaction Details
TargetHistamine H1 receptor
LigandBDBM50019629
Substrate/Competitorn/a
Meas. Tech.ChEBML_75330
IC50 11±n/a nM
Citation Iemura, RKawashima, TFukuda, TIto, KTsukamoto, G Synthesis of 2-(4-substituted-1-piperazinyl)benzimidazoles as H1-antihistaminic agents. J Med Chem29:1178-83 (1987) Histamine H1 receptor
Name:Histamine H1 receptor
Type:G Protein-Coupled Receptor (GPCR)
Mol. Mass.:55641.53
Organism:Cavia porcellus (domestic guinea pig)
Description:Guinea pig cerebellum was used in binding assay.
Residue:488
BDBM50019629
NameBDBM50019629
Synonyms:1-(2-Ethoxy-ethyl)-2-piperazin-1-yl-1H-benzoimidazole | CHEMBL278053
TypeSmall organic molecule
Emp. Form.C15H22N4O
Mol. Mass.274.3614
SMILESCCOCCn1c(nc2ccccc12)N1CCNCC1