Reaction Details
TargetThymidylate synthase
LigandBDBM50022282
Substrate/Competitorn/a
Meas. Tech.ChEBML_209111
IC50 500000±n/a nM
Citation Ghazala, MNair, MGToghiyani, TRKisliuk, RLGaumont, YKalman, TI Folate analogues. 25. Synthesis and biological evaluation of N10-propargylfolic acid and its reduced derivatives. J Med Chem29:1263-9 (1987) Thymidylate synthase
Name:Thymidylate synthase
Type:Enzyme
Mol. Mass.:36576.54
Organism:Lactobacillus casei
Description:n/a
Residue:316
BDBM50022282
NameBDBM50022282
Synonyms:2-{4-[(2-Amino-4-hydroxy-7,8-dihydro-pteridin-6-ylmethyl)-prop-2-ynyl-amino]-benzoylamino}-pentanedioic acid | CHEMBL23594
TypeSmall organic molecule
Emp. Form.C22H23N7O6
Mol. Mass.481.4613
SMILESNc1nc2NCC(CN(CC#C)c3ccc(cc3)C(=O)NC(CCC(O)=O)C(O)=O)=Nc2c(=O)[nH]1