Reaction Details
TargetCytidine deaminase
LigandBDBM50367346
Substrate/Competitorn/a
Meas. Tech.ChEBML_52531
Ki 400±n/a nM
Citation Kim, CHMarquez, VEMao, DTHaines, DRMcCormack, JJ Synthesis of pyrimidin-2-one nucleosides as acid-stable inhibitors of cytidine deaminase. J Med Chem29:1374-80 (1986) Cytidine deaminase
Name:Cytidine deaminase
Type:PROTEIN
Mol. Mass.:16129.75
Organism:Mus musculus
Description:ChEMBL_52531
Residue:146
BDBM50367346
NameBDBM50367346
Synonyms:CHEMBL605877
TypeSmall organic molecule
Emp. Form.C10H16N2O6
Mol. Mass.260.2438
SMILESOC[C@H]1OC([C@H](O)[C@@H]1O)N1C=CC(CO)NC1=O