Reaction Details
TargetCytidine deaminase
LigandBDBM50391219
Substrate/Competitorn/a
Meas. Tech.ChEBML_52531
Ki 100±n/a nM
Citation Kim, CHMarquez, VEMao, DTHaines, DRMcCormack, JJ Synthesis of pyrimidin-2-one nucleosides as acid-stable inhibitors of cytidine deaminase. J Med Chem29:1374-80 (1986) Cytidine deaminase
Name:Cytidine deaminase
Type:PROTEIN
Mol. Mass.:16129.75
Organism:Mus musculus
Description:ChEMBL_52531
Residue:146
BDBM50391219
NameBDBM50391219
Synonyms:CHEMBL2093931
TypeSmall organic molecule
Emp. Form.C10H18N2O6
Mol. Mass.262.2597
SMILESOC[C@H]1O[C@H]([C@H](O)[C@@H]1O)N1CC[C@@H](O)CNC1=O