Reaction Details
TargetDihydrofolate reductase
LigandBDBM50023899
Substrate/Competitorn/a
Meas. Tech.ChEBML_53887
IC50 57±n/a nM
Citation Rosowsky, ABader, HRadike-Smith, MCucchi, CAWick, MMFreisheim, JH Methotrexate analogues. 28. Synthesis and biological evaluation of new gamma-monoamides of aminopterin and methotrexate. J Med Chem29:1703-9 (1986) Dihydrofolate reductase
Name:Dihydrofolate reductase
Type:Enzyme
Mol. Mass.:21608.82
Organism:Mus musculus (Mouse)
Description:n/a
Residue:187
BDBM50023899
NameBDBM50023899
Synonyms:2-{4-[(2,4-Diamino-pteridin-6-ylmethyl)-amino]-benzoylamino}-4-(3,4-dihydroxy-phenylcarbamoyl)-butyric acid | CHEMBL45679
TypeSmall organic molecule
Emp. Form.C25H25N9O6
Mol. Mass.547.5227
SMILESNc1nc(N)c2nc(CNc3ccc(cc3)C(=O)NC(CCC(=O)Nc3ccc(O)c(O)c3)C(O)=O)cnc2n1