Reaction Details
TargetDihydrofolate reductase
LigandBDBM50022233
Substrate/Competitorn/a
Meas. Tech.ChEBML_53306
IC50 340±n/a nM
Citation Nair, MGNanavati, NTNair, IGKisliuk, RLGaumont, YHsiao, MCKalman, TI Folate analogues. 26. Syntheses and antifolate activity of 10-substituted derivatives of 5,8-dideazafolic acid and of the poly-gamma-glutamyl metabolites of N10-propargyl-5,8-dideazafolic acid (PDDF). J Med Chem29:1754-60 (1986) Dihydrofolate reductase
Name:Dihydrofolate reductase
Type:Enzyme
Mol. Mass.:21453.99
Organism:Homo sapiens (Human)
Description:Recombinant human DHFR.
Residue:187
BDBM50022233
NameBDBM50022233
Synonyms:4-(2-{4-[(2-Amino-4-hydroxy-quinazolin-6-ylmethyl)-ethynyl-amino]-benzoylamino}-4-carboxy-butyrylamino)-4-carboxy-butyric acid anion
TypeSmall organic molecule
Emp. Form.C28H27N6O9
Mol. Mass.591.5493
SMILESNc1nc2ccc(CN(C#C)c3ccc(cc3)C(=O)NC(CCC(O)=O)C(=O)NC(CCC([O-])=O)C(O)=O)cc2c(=O)[nH]1