Reaction Details
TargetDihydrofolate reductase
LigandBDBM50022236
Substrate/Competitorn/a
Meas. Tech.ChEBML_54904
IC50 250000±n/a nM
Citation Nair, MGNanavati, NTNair, IGKisliuk, RLGaumont, YHsiao, MCKalman, TI Folate analogues. 26. Syntheses and antifolate activity of 10-substituted derivatives of 5,8-dideazafolic acid and of the poly-gamma-glutamyl metabolites of N10-propargyl-5,8-dideazafolic acid (PDDF). J Med Chem29:1754-60 (1986) Dihydrofolate reductase
Name:Dihydrofolate reductase
Type:PROTEIN
Mol. Mass.:18437.08
Organism:Lactobacillus casei
Description:ChEMBL_1357878
Residue:163
BDBM50022236
NameBDBM50022236
Synonyms:(S)-2-{4-[(2-Amino-4-oxo-3,4-dihydro-quinazolin-6-ylmethyl)-but-2-ynyl-amino]-benzoylamino}-pentanedioic acid | CHEMBL48619
TypeSmall organic molecule
Emp. Form.C25H25N5O6
Mol. Mass.491.4959
SMILESCC#CCN(Cc1ccc2nc(N)[nH]c(=O)c2c1)c1ccc(cc1)C(=O)N[C@@H](CCC(O)=O)C(O)=O