Reaction Details
TargetD(2) dopamine receptor
LigandBDBM50367422
Substrate/Competitorn/a
Meas. Tech.ChEMBL_62717 (CHEMBL671460)
Ki 26±n/a nM
Citation Abou-Gharbia, MPatel, URWebb, MBMoyer, JAAndree, THMuth, EA Antipsychotic activity of substituted gamma-carbolines. J Med Chem30:1818-23 (1987) D(2) dopamine receptor
Name:D(2) dopamine receptor
Type:G Protein-Coupled Receptor (GPCR)
Mol. Mass.:50931.60
Organism:Rattus norvegicus (rat)
Description:P61169
Residue:444
BDBM50367422
NameBDBM50367422
Synonyms:CHEMBL1743935
TypeSmall organic molecule
Emp. Form.C18H18FN3
Mol. Mass.295.354
SMILESFc1ccc2[nH]c3CCN(CCc4ccccn4)Cc3c2c1