Reaction Details
TargetD(2) dopamine receptor
LigandBDBM50367433
Substrate/Competitorn/a
Meas. Tech.ChEMBL_62728 (CHEMBL671470)
Ki 7±n/a nM
Citation Abou-Gharbia, MPatel, URWebb, MBMoyer, JAAndree, THMuth, EA Antipsychotic activity of substituted gamma-carbolines. J Med Chem30:1818-23 (1987) D(2) dopamine receptor
Name:D(2) dopamine receptor
Type:G Protein-Coupled Receptor (GPCR)
Mol. Mass.:50931.60
Organism:Rattus norvegicus (rat)
Description:P61169
Residue:444
BDBM50367433
NameBDBM50367433
Synonyms:CHEMBL1743945
TypeSmall organic molecule
Emp. Form.C26H25F2N3
Mol. Mass.417.4936
SMILESFc1ccc(cc1)-n1c2CCN(CCCCc3ccncc3)Cc2c2cc(F)ccc12