Reaction Details
TargetcGMP-dependent 3',5'-cyclic phosphodiesterase
LigandBDBM15296
Substrate/Competitorn/a
Meas. Tech.ChEBML_154259
IC50 200000±n/a nM
Citation Moos, WHHumblet, CCSircar, IRithner, CWeishaar, REBristol, JAMcPhail, AT Cardiotonic agents. 8. Selective inhibitors of adenosine 3',5'-cyclic phosphate phosphodiesterase III. Elaboration of a five-point model for positive inotropic activity. J Med Chem30:1963-72 (1987) cGMP-dependent 3',5'-cyclic phosphodiesterase
Name:cGMP-dependent 3',5'-cyclic phosphodiesterase
Type:Enzyme Catalytic Domain
Mol. Mass.:105691.58
Organism:Homo sapiens (Human)
Description:O00408
Residue:941
BDBM15296
NameBDBM15296
Synonyms:6-methyl-2-oxo-5-(pyridin-4-yl)-1,2-dihydropyridine-3-carbonitrile CHEMBL189 Primacor US9249139, Milrinone
TypeSmall organic molecule
Emp. Form.C12H9N3O
Mol. Mass.211.2194
SMILESCc1[nH]c(=O)c(cc1-c1ccncc1)C#N