Reaction Details
TargetGlutamine synthetase
LigandBDBM50019955
Substrate/Competitorn/a
Meas. Tech.ChEMBL_72139 (CHEMBL685937)
Ki 250000±n/a nM
Citation Farrington, GKKumar, AWedler, FC Design and synthesis of phosphonate inhibitors of glutamine synthetase. J Med Chem30:2062-7 (1987) Glutamine synthetase
Name:Glutamine synthetase
Type:Protein
Mol. Mass.:42066.51
Organism:Homo sapiens (Human)
Description:P15104
Residue:373
BDBM50019955
NameBDBM50019955
Synonyms:2-ammonio-4-[hydroxy(phosphonomethyl)phosphoryl]butanoate
TypeSmall organic molecule
Emp. Form.C5H12NO7P2
Mol. Mass.260.0994
SMILES[NH3+]C(CCP([O-])(=O)CP(O)(O)=O)C([O-])=O