Reaction Details
TargetPolyunsaturated fatty acid 5-lipoxygenase
LigandBDBM50015184
Substrate/Competitorn/a
Meas. Tech.ChEBML_3912
IC50 110000±n/a nM
Citation Summers, JBMazdiyasni, HHolms, JHRatajczyk, JDDyer, RDCarter, GW Hydroxamic acid inhibitors of 5-lipoxygenase. J Med Chem30:574-80 (1987) Polyunsaturated fatty acid 5-lipoxygenase
Name:Polyunsaturated fatty acid 5-lipoxygenase
Type:PROTEIN
Mol. Mass.:78082.31
Organism:Rattus norvegicus
Description:ChEMBL_1432947
Residue:673
BDBM50015184
NameBDBM50015184
Synonyms:BENZHYDROXAMIC ACID CHEMBL16300 N-hydroxybenzamide | benzoyl hydroxamic acid
TypeSmall organic molecule
Emp. Form.C7H7NO2
Mol. Mass.137.136
SMILESONC(=O)c1ccccc1