Reaction Details
TargetCarbonic anhydrase 2
LigandBDBM50024224
Substrate/Competitorn/a
Meas. Tech.ChEBML_45070
Ki 3.30±n/a nM
Citation Ponticello, GSFreedman, MBHabecker, CNLyle, PASchwam, HVarga, SLChristy, MERandall, WCBaldwin, JJ Thienothiopyran-2-sulfonamides: a novel class of water-soluble carbonic anhydrase inhibitors. J Med Chem30:591-7 (1987) Carbonic anhydrase 2
Name:Carbonic anhydrase 2
Type:Enzyme
Mol. Mass.:29250.71
Organism:Homo sapiens (Human)
Description:P00918
Residue:260
BDBM50024224
NameBDBM50024224
Synonyms:7,7-Dioxo-4,5,6,7-tetrahydro-7lambda*6*-thieno[2,3-b]thiopyran-2-sulfonic acid amide | CHEMBL333193
TypeSmall organic molecule
Emp. Form.C7H9NO4S3
Mol. Mass.267.346
SMILESNS(=O)(=O)c1cc2CCCS(=O)(=O)c2s1