Reaction Details
TargetThymidylate synthase
LigandBDBM50367343
Substrate/Competitorn/a
Meas. Tech.ChEMBL_209474 (CHEMBL809254)
IC50 290000±n/a nM
Citation Brixner, DIUeda, TCheng, YCHynes, JBBroom, AD Folate analogues as inhibitors of thymidylate synthase. J Med Chem30:675-8 (1987) Thymidylate synthase
Name:Thymidylate synthase
Type:Enzyme
Mol. Mass.:35718.07
Organism:Homo sapiens (Human)
Description:n/a
Residue:313
BDBM50367343
NameBDBM50367343
Synonyms:(2S)-2-[[4-[(2-amino-4-oxo-1H-pteridin-6-yl)methylamino]benzoyl]amino]pentanedioic acid Folacin Vitamin B9 | Vitamin M
TypeSmall organic molecule
Emp. Form.C19H19N7O6
Mol. Mass.441.3975
SMILESNc1nc2ncc(CNc3ccc(cc3)C(=O)N[C@@H](CCC(O)=O)C(O)=O)nc2c(=O)[nH]1