Reaction Details
TargetThymidylate synthase
LigandBDBM18771
Substrate/Competitorn/a
Meas. Tech.ChEMBL_209645 (CHEMBL811586)
Ki 20000±n/a nM
Citation Brixner, DIUeda, TCheng, YCHynes, JBBroom, AD Folate analogues as inhibitors of thymidylate synthase. J Med Chem30:675-8 (1987) Thymidylate synthase
Name:Thymidylate synthase
Type:Enzyme
Mol. Mass.:35718.07
Organism:Homo sapiens (Human)
Description:n/a
Residue:313
BDBM18771
NameBDBM18771
Synonyms:(2S)-2-[(4-{[(2-amino-4-oxo-1,4-dihydroquinazolin-6-yl)methyl](prop-2-yn-1-yl)amino}phenyl)formamido]pentanedioic acid CHEMBL389051 | PDDF
TypeSmall organic molecule
Emp. Form.C24H23N5O6
Mol. Mass.477.4693
SMILESNc1nc2ccc(CN(CC#C)c3ccc(cc3)C(=O)N[C@@H](CCC(O)=O)C(O)=O)cc2c(=O)[nH]1