Reaction Details
TargetThymidylate synthase
LigandBDBM50023901
Substrate/Competitorn/a
Meas. Tech.ChEMBL_209474 (CHEMBL809254)
IC50 2500±n/a nM
Citation Brixner, DIUeda, TCheng, YCHynes, JBBroom, AD Folate analogues as inhibitors of thymidylate synthase. J Med Chem30:675-8 (1987) Thymidylate synthase
Name:Thymidylate synthase
Type:Enzyme
Mol. Mass.:35718.07
Organism:Homo sapiens (Human)
Description:n/a
Residue:313
BDBM50023901
NameBDBM50023901
Synonyms:2-{4-[(2-Amino-4-hydroxy-pyrido[3,2-d]pyrimidin-6-ylmethyl)-methyl-amino]-benzoylamino}-pentanedioic acid(8-deaza-10-methylfolate) | CHEMBL158790
TypeSmall organic molecule
Emp. Form.C21H22N6O6
Mol. Mass.454.436
SMILESCN(Cc1ccc2nc(N)[nH]c(=O)c2n1)c1ccc(cc1)C(=O)N[C@@H](CCC(O)=O)C(O)=O