Reaction Details
TargetThymidylate synthase
LigandBDBM50023904
Substrate/Competitorn/a
Meas. Tech.ChEMBL_209474 (CHEMBL809254)
IC50 290±n/a nM
Citation Brixner, DIUeda, TCheng, YCHynes, JBBroom, AD Folate analogues as inhibitors of thymidylate synthase. J Med Chem30:675-8 (1987) Thymidylate synthase
Name:Thymidylate synthase
Type:Enzyme
Mol. Mass.:35718.07
Organism:Homo sapiens (Human)
Description:n/a
Residue:313
BDBM50023904
NameBDBM50023904
Synonyms:2-{4-[(2-Amino-4-oxo-3,4-dihydro-quinazolin-6-ylmethyl)-methyl-amino]-benzoylamino}-pentanedioic acid | CHEMBL347223
TypeSmall organic molecule
Emp. Form.C22H23N5O6
Mol. Mass.453.4479
SMILESCN(Cc1ccc2nc(N)[nH]c(=O)c2c1)c1ccc(cc1)C(=O)N[C@@H](CCC(O)=O)C(O)=O