Reaction Details
TargetVoltage-dependent L-type calcium channel subunit alpha-1C
LigandBDBM50452435
Substrate/Competitorn/a
Meas. Tech.ChEBML_53174
Ki 30±n/a nM
Citation Baldwin, JJClaremon, DALumma, PKMcClure, DERosenthal, SAWinquist, RJFaison, EPKaczorowski, GJTrumble, MJSmith, GM Diethyl 3,6-dihydro-2,4-dimethyl-2,6-methano-1,3-benzothiazocine-5,11- dicarboxylates as calcium entry antagonists: new conformationally restrained analogues of Hantzsch 1,4-dihydropyridines related to nitrendipine as probes for receptor-site conformation. J Med Chem30:690-5 (1987) Voltage-dependent L-type calcium channel subunit alpha-1C
Name:Voltage-dependent L-type calcium channel subunit alpha-1C
Type:Enzyme Catalytic Domain
Mol. Mass.:248979.79
Organism:Homo sapiens (Human)
Description:Calcium channel (Type L) 0 HUMAN::Q13936
Residue:2221
BDBM50452435
NameBDBM50452435
Synonyms:CHEMBL2110302
TypeSmall organic molecule
Emp. Form.C19H22N2O6S
Mol. Mass.406.453
SMILES[H][C@@]12[C@@H](C(=O)OCC)[C@@](C)(Sc3ccc(cc13)[N+]([O-])=O)N=C(C)\C2=C(\O)OCC