Reaction Details
TargetVoltage-dependent L-type calcium channel subunit alpha-1C
LigandBDBM50016398
Substrate/Competitorn/a
Meas. Tech.ChEBML_53174
Ki 80±n/a nM
Citation Baldwin, JJClaremon, DALumma, PKMcClure, DERosenthal, SAWinquist, RJFaison, EPKaczorowski, GJTrumble, MJSmith, GM Diethyl 3,6-dihydro-2,4-dimethyl-2,6-methano-1,3-benzothiazocine-5,11- dicarboxylates as calcium entry antagonists: new conformationally restrained analogues of Hantzsch 1,4-dihydropyridines related to nitrendipine as probes for receptor-site conformation. J Med Chem30:690-5 (1987) Voltage-dependent L-type calcium channel subunit alpha-1C
Name:Voltage-dependent L-type calcium channel subunit alpha-1C
Type:Enzyme Catalytic Domain
Mol. Mass.:248979.79
Organism:Homo sapiens (Human)
Description:Calcium channel (Type L) 0 HUMAN::Q13936
Residue:2221
BDBM50016398
NameBDBM50016398
Synonyms:2,6-Dimethyl-4-(2-methylsulfanyl-5-nitro-phenyl)-1,4-dihydro-pyridine-3,5-dicarboxylic acid diethyl ester | CHEMBL161165
TypeSmall organic molecule
Emp. Form.C20H24N2O6S
Mol. Mass.420.479
SMILESCCOC([O-])=C1C(C(C(=[OH+])OCC)=C(C)N=C1C)c1cc(ccc1SC)[N+]([O-])=O