Reaction Details
TargetRyanodine receptor 1
LigandBDBM50016407
Substrate/Competitorn/a
Meas. Tech.ChEMBL_921272 (CHEMBL3054398)
IC50>10000±n/a nM
Citation Waterhouse, ALPessah, INFrancini, AOCasida, JE Structural aspects of ryanodine action and selectivity. J Med Chem30:710-6 (1987) Ryanodine receptor 1
Name:Ryanodine receptor 1
Type:PROTEIN
Mol. Mass.:565099.26
Organism:Oryctolagus cuniculus
Description:ChEMBL_19634
Residue:5037
BDBM50016407
NameBDBM50016407
Synonyms:6,11,14-trihydroxy-11-isopropyl-2,9,13-trimethoxy-3,7,10-trimethyl-(1R,2R,3S,6S,7S,9S,10R,11S,12R,13S,14R)-15-oxapentacyclo[7.5.1.01,6.07,13.010,14]pentadec-12-yl 1-methyl-1H-2-pyrrolecarboxylate | CHEMBL2273050
TypeSmall organic molecule
Emp. Form.C29H43NO9
Mol. Mass.549.653
SMILESCO[C@@H]1[C@@H](C)CC[C@]2(O)[C@]3(C)C[C@]4(OC)O[C@]12[C@@]1(O)[C@]4(C)[C@@](O)(C(C)C)[C@@H](OC(=O)c2cccn2C)[C@@]31OC