Reaction Details
TargetRyanodine receptor 1
LigandBDBM50016405
Substrate/Competitorn/a
Meas. Tech.ChEMBL_921272 (CHEMBL3054398)
IC50 860±n/a nM
Citation Waterhouse, ALPessah, INFrancini, AOCasida, JE Structural aspects of ryanodine action and selectivity. J Med Chem30:710-6 (1987) Ryanodine receptor 1
Name:Ryanodine receptor 1
Type:PROTEIN
Mol. Mass.:565099.26
Organism:Oryctolagus cuniculus
Description:ChEMBL_19634
Residue:5037
BDBM50016405
NameBDBM50016405
Synonyms:2,6,9,11,13,14-hexahydroxy-11-isopropyl-3,7,10-trimethyl-(1R,2R,3S,6S,7S,9S,10R,11S,12R,13S,14R)-15-oxapentacyclo[7.5.1.01,6.07,13.010,14]pentadec-12-yl 1-butyl-1H-2-pyrrolecarboxylate N-BUTYLRYANODINE
TypeSmall organic molecule
Emp. Form.C29H43NO9
Mol. Mass.549.653
SMILESCCCCn1cccc1C(=O)O[C@@H]1[C@](O)(C(C)C)[C@]2(C)[C@]3(O)C[C@@]4(C)[C@@]5(O)CC[C@H](C)[C@@H](O)[C@]5(O3)[C@]2(O)[C@@]14O