Reaction Details
TargetRyanodine receptor 1
LigandBDBM50016413
Substrate/Competitorn/a
Meas. Tech.ChEMBL_921272 (CHEMBL3054398)
IC50 88±n/a nM
Citation Waterhouse, ALPessah, INFrancini, AOCasida, JE Structural aspects of ryanodine action and selectivity. J Med Chem30:710-6 (1987) Ryanodine receptor 1
Name:Ryanodine receptor 1
Type:PROTEIN
Mol. Mass.:565099.26
Organism:Oryctolagus cuniculus
Description:ChEMBL_19634
Residue:5037
BDBM50016413
NameBDBM50016413
Synonyms:18-HYDROXYRYANODINE CHEMBL352124
TypeSmall organic molecule
Emp. Form.C25H35NO10
Mol. Mass.509.5461
SMILESCC(CO)[C@@]1(O)[C@@H](OC(=O)c2ccc[nH]2)[C@@]2(O)[C@@]3(C)C[C@]4(O)O[C@@]5([C@H](O)[C@@H](C)CC[C@]35O)[C@@]2(O)[C@]14C