Reaction Details
TargetThymidine kinase, cytosolic
LigandBDBM50367488
Substrate/Competitorn/a
Meas. Tech.ChEMBL_207845 (CHEMBL810054)
Ki 140±n/a nM
Citation Mansuri, MMGhazzouli, IChen, MSHowell, HGBrodfuehrer, PRBenigni, DAMartin, JC 1-(2-Deoxy-2-fluoro-beta-D-arabinofuranosyl)-5-ethyluracil. A highly selective antiherpes simplex agent. J Med Chem30:867-71 (1987) Thymidine kinase, cytosolic
Name:Thymidine kinase, cytosolic
Type:PROTEIN
Mol. Mass.:25476.50
Organism:Homo sapiens (Human)
Description:ChEMBL_1333884
Residue:234
BDBM50367488
NameBDBM50367488
Synonyms:FIALURIDINE
TypeSmall organic molecule
Emp. Form.C9H10FIN2O5
Mol. Mass.372.089
SMILESOC[C@H]1O[C@H]([C@@H](F)[C@@H]1O)n1cc(I)c(=O)[nH]c1=O