Reaction Details
TargetThymidine kinase, cytosolic
LigandBDBM50367487
Substrate/Competitorn/a
Meas. Tech.ChEMBL_207845 (CHEMBL810054)
Ki 180±n/a nM
Citation Mansuri, MMGhazzouli, IChen, MSHowell, HGBrodfuehrer, PRBenigni, DAMartin, JC 1-(2-Deoxy-2-fluoro-beta-D-arabinofuranosyl)-5-ethyluracil. A highly selective antiherpes simplex agent. J Med Chem30:867-71 (1987) Thymidine kinase, cytosolic
Name:Thymidine kinase, cytosolic
Type:PROTEIN
Mol. Mass.:25476.50
Organism:Homo sapiens (Human)
Description:ChEMBL_1333884
Residue:234
BDBM50367487
NameBDBM50367487
Synonyms:CHEMBL475717
TypeSmall organic molecule
Emp. Form.C10H13FN2O5
Mol. Mass.260.219
SMILESCc1cn([C@@H]2O[C@H](CO)[C@@H](O)[C@@H]2F)c(=O)[nH]c1=O