Reaction Details
TargetDipeptidase 1
LigandBDBM50023947
Substrate/Competitorn/a
Meas. Tech.ChEBML_216035
Ki 92±n/a nM
Citation Graham, DWAshton, WTBarash, LBrown, JEBrown, RDCanning, LFChen, ASpringer, JPRogers, EF Inhibition of the mammalian beta-lactamase renal dipeptidase (dehydropeptidase-I) by (Z)-2-(acylamino)-3-substituted-propenoic acids. J Med Chem30:1074-90 (1987) Dipeptidase 1
Name:Dipeptidase 1
Type:Enzyme Catalytic Domain
Mol. Mass.:44697.32
Organism:GUINEA PIG
Description:Leukotriene D4 Alpha 0 GUINEA PIG::P22412
Residue:409
BDBM50023947
NameBDBM50023947
Synonyms:2,11-Bis-[(2,2-dimethyl-cyclopropanecarbonyl)-amino]-dodeca-2,10-dienedioic acid | CHEMBL11961
TypeSmall organic molecule
Emp. Form.C24H36N2O6
Mol. Mass.448.5524
SMILESCC1(C)CC1C(=O)N\C(=C/CCCCCC\C=C(/NC(=O)C1CC1(C)C)C(O)=O)C(O)=O