Reaction Details
TargetDipeptidase 1
LigandBDBM50023971
Substrate/Competitorn/a
Meas. Tech.ChEBML_216035
Ki 140±n/a nM
Citation Graham, DWAshton, WTBarash, LBrown, JEBrown, RDCanning, LFChen, ASpringer, JPRogers, EF Inhibition of the mammalian beta-lactamase renal dipeptidase (dehydropeptidase-I) by (Z)-2-(acylamino)-3-substituted-propenoic acids. J Med Chem30:1074-90 (1987) Dipeptidase 1
Name:Dipeptidase 1
Type:Enzyme Catalytic Domain
Mol. Mass.:44697.32
Organism:GUINEA PIG
Description:Leukotriene D4 Alpha 0 GUINEA PIG::P22412
Residue:409
BDBM50023971
NameBDBM50023971
Synonyms:2-[(2,2-Dimethyl-cyclopropanecarbonyl)-amino]-hex-2-enedioic acid | CHEMBL11830
TypeSmall organic molecule
Emp. Form.C12H17NO5
Mol. Mass.255.2671
SMILESCC1(C)CC1C(=O)N\C(=C/CCC(O)=O)C(O)=O